Reaction Details
TargetSodium channel protein type 7 subunit alpha
LigandBDBM155928
Substrate/Competitorn/a
Meas. Tech.ChEMBL_1515524 (CHEMBL3615705)
IC50>30000±n/a nM
Citation Walsh, SPShahripour, ATang, HTeumelsan, NFrie, JZhu, YPriest, BTSwensen, AMLiu, JMargulis, MVisconti, RWeinglass, AFelix, JPBrochu, RMBailey, TThomas-Fowlkes, BAlonso-Galicia, MZhou, XPai, LYCorona, AHampton, CHernandez, MBentley, RChen, JShah, KMetzger, JForrest, MOwens, KTong, VHa, SRoy, SKaczorowski, GJYang, LParmee, EGarcia, MLSullivan, KPasternak, A Discovery of a Potent and Selective ROMK Inhibitor with Pharmacokinetic Properties Suitable for Preclinical Evaluation. ACS Med Chem Lett6:747-52 (2015) 
 
Sodium channel protein type 7 subunit alpha
Name:Sodium channel protein type 7 subunit alpha
Type:PROTEIN
Mol. Mass.:193514.99
Organism:Homo sapiens (Human)
Description:ChEMBL_105639
Residue:1682
BDBM155928
NameBDBM155928
Synonyms:US9018211, 52
TypeSmall organic molecule
Emp. Form.C24H28N4O5
Mol. Mass.452.5029
SMILESCOc1cc(ncc1C#N)[C@@H](O)CN1CCN(C[C@H](O)c2ccc3C(=O)OCc3c2C)CC1