Reaction Details
TargetPotassium voltage-gated channel subfamily H member 2
LigandBDBM50116828
Substrate/Competitorn/a
Meas. Tech.ChEMBL_1515502 (CHEMBL3615683)
IC50 2800±n/a nM
Citation Walsh, SPShahripour, ATang, HTeumelsan, NFrie, JZhu, YPriest, BTSwensen, AMLiu, JMargulis, MVisconti, RWeinglass, AFelix, JPBrochu, RMBailey, TThomas-Fowlkes, BAlonso-Galicia, MZhou, XPai, LYCorona, AHampton, CHernandez, MBentley, RChen, JShah, KMetzger, JForrest, MOwens, KTong, VHa, SRoy, SKaczorowski, GJYang, LParmee, EGarcia, MLSullivan, KPasternak, A Discovery of a Potent and Selective ROMK Inhibitor with Pharmacokinetic Properties Suitable for Preclinical Evaluation. ACS Med Chem Lett6:747-52 (2015) 
 
Potassium voltage-gated channel subfamily H member 2
Name:Potassium voltage-gated channel subfamily H member 2
Type:Multi-pass membrane protein
Mol. Mass.:126672.65
Organism:Homo sapiens (Human)
Description:Q12809
Residue:1159
BDBM50116828
NameBDBM50116828
Synonyms:CHEMBL3612797
TypeSmall organic molecule
Emp. Form.C26H31N3O3
Mol. Mass.433.5426
SMILESCOc1cc(CCN2CCN(CC(C)c3ccc4C(=O)OCc4c3C)CC2)ccc1C#N