Reaction Details
TargetATP-sensitive inward rectifier potassium channel 1
LigandBDBM50116843
Substrate/Competitorn/a
Meas. Tech.ChEMBL_1515501 (CHEMBL3615682)
IC50 43.0±n/a nM
Citation Walsh, SPShahripour, ATang, HTeumelsan, NFrie, JZhu, YPriest, BTSwensen, AMLiu, JMargulis, MVisconti, RWeinglass, AFelix, JPBrochu, RMBailey, TThomas-Fowlkes, BAlonso-Galicia, MZhou, XPai, LYCorona, AHampton, CHernandez, MBentley, RChen, JShah, KMetzger, JForrest, MOwens, KTong, VHa, SRoy, SKaczorowski, GJYang, LParmee, EGarcia, MLSullivan, KPasternak, A Discovery of a Potent and Selective ROMK Inhibitor with Pharmacokinetic Properties Suitable for Preclinical Evaluation. ACS Med Chem Lett6:747-52 (2015) 
 
ATP-sensitive inward rectifier potassium channel 1
Name:ATP-sensitive inward rectifier potassium channel 1
Type:Enzyme Catalytic Domain
Mol. Mass.:44809.08
Organism:Homo sapiens (Human)
Description:gi_223460826
Residue:391
BDBM50116843
NameBDBM50116843
Synonyms:CHEMBL3612811
TypeSmall organic molecule
Emp. Form.C25H29N3O5
Mol. Mass.451.5149
SMILESCOc1cc(ccc1C#N)C(O)CN1CCN(C[C@H](O)c2ccc3C(=O)OCc3c2C)CC1