Reaction Details
TargetATP-sensitive inward rectifier potassium channel 1
LigandBDBM50116821
Substrate/Competitorn/a
Meas. Tech.ChEMBL_1515501 (CHEMBL3615682)
IC50 300±n/a nM
Citation Walsh, SPShahripour, ATang, HTeumelsan, NFrie, JZhu, YPriest, BTSwensen, AMLiu, JMargulis, MVisconti, RWeinglass, AFelix, JPBrochu, RMBailey, TThomas-Fowlkes, BAlonso-Galicia, MZhou, XPai, LYCorona, AHampton, CHernandez, MBentley, RChen, JShah, KMetzger, JForrest, MOwens, KTong, VHa, SRoy, SKaczorowski, GJYang, LParmee, EGarcia, MLSullivan, KPasternak, A Discovery of a Potent and Selective ROMK Inhibitor with Pharmacokinetic Properties Suitable for Preclinical Evaluation. ACS Med Chem Lett6:747-52 (2015) 
 
ATP-sensitive inward rectifier potassium channel 1
Name:ATP-sensitive inward rectifier potassium channel 1
Type:Enzyme Catalytic Domain
Mol. Mass.:44809.08
Organism:Homo sapiens (Human)
Description:gi_223460826
Residue:391
BDBM50116821
NameBDBM50116821
Synonyms:CHEMBL3612804
TypeSmall organic molecule
Emp. Form.C27H33N3O3
Mol. Mass.447.5692
SMILESCOc1cc(ccc1C#N)C(C)(C)CN1CCN(CCc2ccc3C(=O)OCc3c2C)CC1