Reaction Details
TargetPotassium voltage-gated channel subfamily H member 2
LigandBDBM155928
Substrate/Competitorn/a
Meas. Tech.ChEMBL_1515505 (CHEMBL3615686)
IC50 33000±n/a nM
Citation Walsh, SPShahripour, ATang, HTeumelsan, NFrie, JZhu, YPriest, BTSwensen, AMLiu, JMargulis, MVisconti, RWeinglass, AFelix, JPBrochu, RMBailey, TThomas-Fowlkes, BAlonso-Galicia, MZhou, XPai, LYCorona, AHampton, CHernandez, MBentley, RChen, JShah, KMetzger, JForrest, MOwens, KTong, VHa, SRoy, SKaczorowski, GJYang, LParmee, EGarcia, MLSullivan, KPasternak, A Discovery of a Potent and Selective ROMK Inhibitor with Pharmacokinetic Properties Suitable for Preclinical Evaluation. ACS Med Chem Lett6:747-52 (2015) 
 
Potassium voltage-gated channel subfamily H member 2
Name:Potassium voltage-gated channel subfamily H member 2
Type:Multi-pass membrane protein
Mol. Mass.:126672.65
Organism:Homo sapiens (Human)
Description:Q12809
Residue:1159
BDBM155928
NameBDBM155928
Synonyms:US9018211, 52
TypeSmall organic molecule
Emp. Form.C24H28N4O5
Mol. Mass.452.5029
SMILESCOc1cc(ncc1C#N)[C@@H](O)CN1CCN(C[C@H](O)c2ccc3C(=O)OCc3c2C)CC1