Reaction Details
TargetPotassium voltage-gated channel subfamily H member 2
LigandBDBM50116797
Substrate/Competitorn/a
Meas. Tech.ChEMBL_1515505 (CHEMBL3615686)
IC50 14000±n/a nM
Citation Walsh, SPShahripour, ATang, HTeumelsan, NFrie, JZhu, YPriest, BTSwensen, AMLiu, JMargulis, MVisconti, RWeinglass, AFelix, JPBrochu, RMBailey, TThomas-Fowlkes, BAlonso-Galicia, MZhou, XPai, LYCorona, AHampton, CHernandez, MBentley, RChen, JShah, KMetzger, JForrest, MOwens, KTong, VHa, SRoy, SKaczorowski, GJYang, LParmee, EGarcia, MLSullivan, KPasternak, A Discovery of a Potent and Selective ROMK Inhibitor with Pharmacokinetic Properties Suitable for Preclinical Evaluation. ACS Med Chem Lett6:747-52 (2015) 
 
Potassium voltage-gated channel subfamily H member 2
Name:Potassium voltage-gated channel subfamily H member 2
Type:Multi-pass membrane protein
Mol. Mass.:126672.65
Organism:Homo sapiens (Human)
Description:Q12809
Residue:1159
BDBM50116797
NameBDBM50116797
Synonyms:CHEMBL3612924
TypeSmall organic molecule
Emp. Form.C26H30N4O4
Mol. Mass.462.5408
SMILESCc1c2COC(=O)c2ccc1[C@@H](O)CN1CCN(CC(O)c2cc(C3CC3)c(cn2)C#N)CC1