Reaction Details
TargetPotassium voltage-gated channel subfamily KQT member 2/3
LigandBDBM50120992
Substrate/Competitorn/a
Meas. Tech.ChEMBL_1520984 (CHEMBL3624288)
EC50 358±n/a nM
Citation Davoren, JEClaffey, MMSnow, SLReese, MRArora, GButler, CRBoscoe, BPChenard, LDeNinno, SLDrozda, SEDuplantier, AJMoine, LRogers, BNRong, SSchuyten, KWright, ASZhang, LSerpa, KAWeber, MLStolyar, PWhisman, TLBaker, KTse, KClark, AJRong, HMather, RJLowe, JA Discovery of a novel Kv7 channel opener as a treatment for epilepsy. Bioorg Med Chem Lett25:4941-4 (2015) 
 
Potassium voltage-gated channel subfamily KQT member 2/3
Name:Potassium voltage-gated channel subfamily KQT member 2/3
Type:n/a
Mol. Mass.:n/a
Description:ASSAY_ID of EBI is 91707
Components:This complex has 3 components.
Component 1
Name:Potassium voltage-gated channel subfamily KQT member 2
Synonyms:KCNQ (Kv7) potassium channel KCNQ2_HUMAN Neuroblastoma-specific potassium channel subunit alpha KvLQT2 Voltage-gated potassium channel subunit Kv7.2
Type:PROTEIN
Mol. Mass.:95883.20
Organism:Homo sapiens (Human)
Description:ChEMBL_1457496
Residue:872
Component 2
Name:Potassium voltage-gated channel subfamily KQT member 3
Synonyms:KCNQ (Kv7) potassium channel KCNQ3_HUMAN | Voltage-gated potassium channel subunit Kv7.3
Type:PROTEIN
Mol. Mass.:96759.41
Organism:Homo sapiens (Human)
Description:ChEMBL_938652
Residue:872
BDBM50120992
NameBDBM50120992
Synonyms:CHEMBL3621445
TypeSmall organic molecule
Emp. Form.C20H34N4O4
Mol. Mass.394.5084
SMILESCOc1nc(nc(OC)c1NC(=O)CC(C)(C)C)N1CCC(CC1)OC(C)C