Reaction Details
TargetNuclear receptor ROR-gamma
LigandBDBM50153603
Substrate/Competitorn/a
Meas. Tech.ChEMBL_1561097 (CHEMBL3776821)
EC50>20000±n/a nM
Citation Hirata, KKotoku, MSeki, NMaeba, TMaeda, KHirashima, SSakai, TObika, SHori, AHase, YYamaguchi, TKatsuda, YHata, TMiyagawa, NArita, KNomura, YAsahina, KAratsu, YKamada, MAdachi, TNoguchi, MDoi, SCrowe, PBradley, ESteensma, RTao, HFenn, MBabine, RLi, XThacher, SHashimoto, HShiozaki, M SAR Exploration Guided by LE and Fsp(3): Discovery of a Selective and Orally Efficacious ROR¿ Inhibitor. ACS Med Chem Lett7:23-7 (2016) 
 
Nuclear receptor ROR-gamma
Name:Nuclear receptor ROR-gamma
Type:PROTEIN
Mol. Mass.:58133.31
Organism:Mus musculus
Description:ChEMBL_103664
Residue:516
BDBM50153603
NameBDBM50153603
Synonyms:CHEMBL3774992
TypeSmall organic molecule
Emp. Form.C26H26N4O2
Mol. Mass.426.5102
SMILESCCn1c(nnc1C1Cc2ccccc2C1)C(O)CC(=O)Nc1cccc2ccccc12