Reaction Details
TargetNuclear receptor ROR-gamma
LigandBDBM50153597
Substrate/Competitorn/a
Meas. Tech.ChEMBL_1561097 (CHEMBL3776821)
EC50 38±n/a nM
Citation Hirata, KKotoku, MSeki, NMaeba, TMaeda, KHirashima, SSakai, TObika, SHori, AHase, YYamaguchi, TKatsuda, YHata, TMiyagawa, NArita, KNomura, YAsahina, KAratsu, YKamada, MAdachi, TNoguchi, MDoi, SCrowe, PBradley, ESteensma, RTao, HFenn, MBabine, RLi, XThacher, SHashimoto, HShiozaki, M SAR Exploration Guided by LE and Fsp(3): Discovery of a Selective and Orally Efficacious ROR¿ Inhibitor. ACS Med Chem Lett7:23-7 (2016) 
 
Nuclear receptor ROR-gamma
Name:Nuclear receptor ROR-gamma
Type:PROTEIN
Mol. Mass.:58133.31
Organism:Mus musculus
Description:ChEMBL_103664
Residue:516
BDBM50153597
NameBDBM50153597
Synonyms:CHEMBL3775807
TypeSmall organic molecule
Emp. Form.C27H38N4O2
Mol. Mass.450.6162
SMILESCC(C)C[C@H]1C[C@H](C1)c1nnc([C@H]2C[C@H](O)C[C@@H]2C(=O)Nc2ccc(C)cc2C)n1C1CC1