Reaction Details
TargetN-lysine methyltransferase SMYD2
LigandBDBM50180978
Substrate/Competitorn/a
Meas. Tech.ChEBML_1585280
IC50 6000±n/a nM
Citation Eggert, EHillig, RCKoehr, SStöckigt, DWeiske, JBarak, NMowat, JBrumby, TChrist, CDTer Laak, ALang, TFernandez-Montalvan, AEBadock, VWeinmann, HHartung, IVBarsyte-Lovejoy, DSzewczyk, MKennedy, SLi, FVedadi, MBrown, PJSanthakumar, VArrowsmith, CHStellfeld, TStresemann, C Discovery and Characterization of a Highly Potent and Selective Aminopyrazoline-Based in Vivo Probe (BAY-598) for the Protein Lysine Methyltransferase SMYD2. J Med Chem59:4578-600 (2016) 
 
N-lysine methyltransferase SMYD2
Name:N-lysine methyltransferase SMYD2
Type:Enzyme
Mol. Mass.:49689.57
Organism:Homo sapiens (Human)
Description:Q9NRG4
Residue:433
BDBM50180978
NameBDBM50180978
Synonyms:CHEMBL3819515
TypeSmall organic molecule
Emp. Form.C21H18ClF2N7O2
Mol. Mass.473.863
SMILESFC(F)Oc1cccc(N\C(=N\C#N)N2CC(N3CNCC3=O)C(=N2)c2ccc(Cl)cc2)c1