Reaction Details
TargetProteinase-activated receptor 1
LigandBDBM50181511
Substrate/Competitorn/a
Meas. Tech.ChEMBL_1585283 (CHEMBL3821546)
IC50 60±n/a nM
Citation Eggert, EHillig, RCKoehr, SStöckigt, DWeiske, JBarak, NMowat, JBrumby, TChrist, CDTer Laak, ALang, TFernandez-Montalvan, AEBadock, VWeinmann, HHartung, IVBarsyte-Lovejoy, DSzewczyk, MKennedy, SLi, FVedadi, MBrown, PJSanthakumar, VArrowsmith, CHStellfeld, TStresemann, C Discovery and Characterization of a Highly Potent and Selective Aminopyrazoline-Based in Vivo Probe (BAY-598) for the Protein Lysine Methyltransferase SMYD2. J Med Chem59:4578-600 (2016) 
 
Proteinase-activated receptor 1
Name:Proteinase-activated receptor 1
Type:Protein
Mol. Mass.:47450.07
Organism:Homo sapiens (Human)
Description:P25116
Residue:425
BDBM50181511
NameBDBM50181511
Synonyms:CHEMBL3819343
TypeSmall organic molecule
Emp. Form.C22H21ClF2N6O3
Mol. Mass.490.89
SMILESCCN(C1CN(N=C1c1ccc(Cl)cc1)C(\Nc1ccc(OC(F)F)cc1)=N/C#N)C(=O)CO