Reaction Details
TargetMitogen-activated protein kinase 1
LigandBDBM103291
Substrate/Competitorn/a
Meas. Tech.IMAP Assay
IC50 37.6±0.0 nM
Citation Cooper, ABDeng, YShipps, Jr., GWShih, NZhu, HYSun, RKelly, JMDoll, RJNan, YWang, TDesai, JAWang, JJDong, YMadison, VSXiao, LHruza, AWSiddiqui, MASamatar, AAPaliwal, STsui, HCelebi, AAWu, YBoga, SBAlhassan, AGao, XZhu, LPatel, M Compounds that are ERK inhibitors US Patent US8546404 Publication Date 10/1/2013
 
Mitogen-activated protein kinase 1
Name:Mitogen-activated protein kinase 1
Type:Protein
Mol. Mass.:41278.65
Organism:Mus musculus (Mouse)
Description:P63085
Residue:358
BDBM103291
NameBDBM103291
Synonyms:US8546404, 413
TypeSmall organic molecule
Emp. Form.C37H35F3N8O3
Mol. Mass.696.7208
SMILESCOC[C@]1(CCN(CC(=O)N2CCC(=CC2)c2ccc(cc2)-c2ncccn2)C1)C(=O)Nc1ccc2[nH]nc(-c3ccnc(c3)C(F)(F)F)c2c1