Reaction Details
TargetMitogen-activated protein kinase 1
LigandBDBM103295
Substrate/Competitorn/a
Meas. Tech.IMAP Assay
IC50 2.1±0.0 nM
Citation Cooper, ABDeng, YShipps, Jr., GWShih, NZhu, HYSun, RKelly, JMDoll, RJNan, YWang, TDesai, JAWang, JJDong, YMadison, VSXiao, LHruza, AWSiddiqui, MASamatar, AAPaliwal, STsui, HCelebi, AAWu, YBoga, SBAlhassan, AGao, XZhu, LPatel, M Compounds that are ERK inhibitors US Patent US8546404 Publication Date 10/1/2013
 
Mitogen-activated protein kinase 1
Name:Mitogen-activated protein kinase 1
Type:Protein
Mol. Mass.:41278.65
Organism:Mus musculus (Mouse)
Description:P63085
Residue:358
BDBM103295
NameBDBM103295
Synonyms:US8546404, 462
TypeSmall organic molecule
Emp. Form.C35H35FN8O3
Mol. Mass.634.7026
SMILESCO[C@]1(CCN(CC(=O)N2CCN(CC2)c2ccc(cc2)-c2ncccn2)C1)C(=O)Nc1ccc2[nH]nc(-c3ccc(F)cc3)c2c1