Reaction Details
TargetGlycogen synthase kinase-3 beta
LigandBDBM225230
Substrate/Competitorn/a
Meas. Tech.HMT Assay
IC50>1.0e+4±n/a nM
Citation Qi, WZhao, KGu, JHuang, YWang, YZhang, HZhang, MZhang, JYu, ZLi, LTeng, LChuai, SZhang, CZhao, MChan, HChen, ZFang, DFei, QFeng, LFeng, LGao, YGe, HGe, XLi, GLingel, ALin, YLiu, YLuo, FShi, MWang, LWang, ZYu, YZeng, JZeng, CZhang, LZhang, QZhou, SOyang, CAtadja, PLi, E An allosteric PRC2 inhibitor targeting the H3K27me3 binding pocket of EED. Nat Chem Biol13:381-388 (2017) 
 
Glycogen synthase kinase-3 beta
Name:Glycogen synthase kinase-3 beta
Type:Enzyme
Mol. Mass.:46756.38
Organism:Homo sapiens (Human)
Description:P49841
Residue:420
BDBM225230
NameBDBM225230
Synonyms:EED226 | US11013745, Compound EED226
TypeSmall organic molecule
Emp. Form.C17H15N5O3S
Mol. Mass.369.398
SMILESCS(=O)(=O)c1ccc(cc1)-c1cnc(NCc2ccco2)n2cnnc12