Reaction Details
TargetTyrosine-protein kinase JAK2
LigandBDBM325371
Substrate/Competitorn/a
Meas. Tech.JAK2 Inhibition Assay
IC50<10±n/a nM
Citation Allen, SBoys, MLChicarelli, MJFell, JBFischer, JPGaudino, JHicken, EJHinklin, RJKraser, CFLaird, ERobinson, JETang, TPBurgess, LERieger, RAPheneger, JSatoh, YLeftheris, KRaheja, RKBennett, BL 4,6-substituted-pyrazolo[1,5-a]pyrazines as Janus kinase inhibitors US Patent US10730880 Publication Date 8/4/2020
 
Tyrosine-protein kinase JAK2
Name:Tyrosine-protein kinase JAK2
Type:Protein
Mol. Mass.:130684.68
Organism:Homo sapiens (Human)
Description:O60674
Residue:1132
BDBM325371
NameBDBM325371
Synonyms:2-methoxy-1-(4-(4-(4-(1- (pentan-3-yl)-1H-pyrazol- 4-yl)pyrazolo[1,5- a]pyrazin-6-yl)-1H- pyrazol-1-yl)piperidin-1- yl)ethanone US10730880, Example 33 | US11028093, Example 33
TypeSmall organic molecule
Emp. Form.C25H32N8O2
Mol. Mass.476.574
SMILESCCC(CC)n1cc(cn1)-c1nc(cn2nccc12)-c1cnn(c1)C1CCN(CC1)C(=O)COC