Reaction Details
TargetGlucocorticoid receptor
LigandBDBM19190
Substrate/CompetitorBDBM18207
Meas. Tech.GR Binding Assay and Human IL-6 Assay
pH7.5±n/a
Temperature277.15±n/a K
IC50 13.8±n/a nM
EC50 4.5±n/a nM
Citation Ali, AThompson, CFBalkovec, JMGraham, DWHammond, MLQuraishi, NTata, JREinstein, MGe, LHarris, GKelly, TMMazur, PPandit, SSantoro, JSitlani, AWang, CWilliamson, JMiller, DKThompson, CMZaller, DMForrest, MJCarballo-Jane, ELuell, S Novel N-arylpyrazolo[3,2-c]-based ligands for the glucocorticoid receptor: receptor binding and in vivo activity. J Med Chem47:2441-52 (2004) 
 
Glucocorticoid receptor
Name:Glucocorticoid receptor
Type:Enzyme
Mol. Mass.:85656.87
Organism:Homo sapiens (Human)
Description:P04150
Residue:777
BDBM19190
BDBM18207
NameBDBM19190
Synonyms:(1S,2R,10S,11S,14R,15S,17S)-14,17-dihydroxy-14-(2-hydroxyacetyl)-2,15-dimethyltetracyclo[8.7.0.0^{2,7}.0^{11,15}]heptadeca-3,6-dien-5-one Delta-Cortef Prednisolone | US10196374, Prednisolone
TypeSteroid
Emp. Form.C21H28O5
Mol. Mass.360.444
SMILES[H][C@@]12CC[C@](O)(C(=O)CO)[C@@]1(C)C[C@H](O)[C@@]1([H])[C@@]2([H])CCC2=CC(=O)C=C[C@]12C