Reaction Details
TargetCytochrome P450 2C8
LigandBDBM50239253
Substrate/Competitorn/a
Meas. Tech.ChEMBL_1665796 (CHEMBL4015592)
IC50 1500±n/a nM
Citation Yeung, KSBeno, BRParcella, KBender, JAGrant-Young, KANickel, AGunaga, PAnjanappa, PBora, ROSelvakumar, KRigat, KWang, YKLiu, MLemm, JMosure, KSheriff, SWan, CWitmer, MKish, KHanumegowda, UZhuo, XShu, YZParker, DHaskell, RNg, AGao, QColston, ERaybon, JGrasela, DMSantone, KGao, MMeanwell, NASinz, MSoars, MGKnipe, JORoberts, SBKadow, JF Discovery of a Hepatitis C Virus NS5B Replicase Palm Site Allosteric Inhibitor (BMS-929075) Advanced to Phase 1 Clinical Studies. J Med Chem60:4369-4385 (2017) 
 
Cytochrome P450 2C8
Name:Cytochrome P450 2C8
Type:Protein
Mol. Mass.:55839.23
Organism:Homo sapiens (Human)
Description:P10632
Residue:490
BDBM50239253
NameBDBM50239253
Synonyms:CHEMBL4088517
TypeSmall organic molecule
Emp. Form.C33H27FN2O3
Mol. Mass.518.5775
SMILESCNC(=O)c1c(oc2ccc(cc12)-c1cc(ccc1C)C(=O)NC1(CC1)c1ccccc1)-c1ccc(F)cc1