Reaction Details
TargetProtein arginine N-methyltransferase 3
LigandBDBM50247357
Substrate/Competitorn/a
Meas. Tech.ChEMBL_1677669 (CHEMBL4027812)
IC50 84±n/a nM
Citation Kaniskan, HÜEram, MSZhao, KSzewczyk, MMYang, XSchmidt, KLuo, XXiao, SDai, MHe, FZang, ILin, YLi, FDobrovetsky, ESmil, DMin, SJLin-Jones, JSchapira, MAtadja, PLi, EBarsyte-Lovejoy, DArrowsmith, CHBrown, PJLiu, FYu, ZVedadi, MJin, J Discovery of Potent and Selective Allosteric Inhibitors of Protein Arginine Methyltransferase 3 (PRMT3). J Med Chem61:1204-1217 (2018) 
 
Protein arginine N-methyltransferase 3
Name:Protein arginine N-methyltransferase 3
Type:PROTEIN
Mol. Mass.:59886.87
Organism:Homo sapiens
Description:ChEMBL_101368
Residue:531
BDBM50247357
NameBDBM50247357
Synonyms:CHEMBL4087094
TypeSmall organic molecule
Emp. Form.C17H20N4O2
Mol. Mass.312.3663
SMILESO=C(NCC(=O)N1CCCCC1)Nc1ccc2cnccc2c1