Reaction Details
TargetCoagulation factor XI
LigandBDBM50250477
Substrate/Competitorn/a
Meas. Tech.ChEBML_1681750
Ki 28±n/a nM
Citation Pinto, DJPOrwat, MJSmith, LMQuan, MLLam, PYSRossi, KAApedo, ABozarth, JMWu, YZheng, JJXin, BToussaint, NStetsko, PGudmundsson, OMaxwell, BCrain, EJWong, PCLou, ZHarper, TWChacko, SAMyers, JESheriff, SZhang, HHou, XMathur, ASeiffert, DAWexler, RRLuettgen, JMEwing, WR Discovery of a Parenteral Small Molecule Coagulation Factor XIa Inhibitor Clinical Candidate (BMS-962212). J Med Chem60:9703-9723 (2017) 
 
Coagulation factor XI
Name:Coagulation factor XI
Type:Enzyme
Mol. Mass.:70130.58
Organism:Homo sapiens (Human)
Description:P03951
Residue:625
BDBM50250477
NameBDBM50250477
Synonyms:CHEMBL4081328
TypeSmall organic molecule
Emp. Form.C28H23ClN6O4
Mol. Mass.542.973
SMILESCc1ccc2CCN(C(C(=O)Nc3ccc(cc3)C(O)=O)c2c1)C(=O)\C=C\c1cc(Cl)ccc1-n1cnnn1