Reaction Details
TargetCoagulation factor XI
LigandBDBM50250500
Substrate/Competitorn/a
Meas. Tech.ChEBML_1681750
Ki 17±n/a nM
Citation Pinto, DJPOrwat, MJSmith, LMQuan, MLLam, PYSRossi, KAApedo, ABozarth, JMWu, YZheng, JJXin, BToussaint, NStetsko, PGudmundsson, OMaxwell, BCrain, EJWong, PCLou, ZHarper, TWChacko, SAMyers, JESheriff, SZhang, HHou, XMathur, ASeiffert, DAWexler, RRLuettgen, JMEwing, WR Discovery of a Parenteral Small Molecule Coagulation Factor XIa Inhibitor Clinical Candidate (BMS-962212). J Med Chem60:9703-9723 (2017) 
 
Coagulation factor XI
Name:Coagulation factor XI
Type:Enzyme
Mol. Mass.:70130.58
Organism:Homo sapiens (Human)
Description:P03951
Residue:625
BDBM50250500
NameBDBM50250500
Synonyms:CHEMBL4082994
TypeSmall organic molecule
Emp. Form.C33H31ClN8O5
Mol. Mass.655.103
SMILESOC(=O)c1ccc(NC(=O)C2N(CCc3c(NC(=O)NC4CCCC4)cccc23)C(=O)\C=C\c2cc(Cl)ccc2-n2cnnn2)cc1