Reaction Details
TargetSqualene synthase
LigandBDBM50052343
Substrate/Competitorn/a
Meas. Tech.ChEMBL_202113 (CHEMBL808971)
IC50 3±n/a nM
Citation Brown, GRClarke, DSFoubister, AJFreeman, SHarrison, PJJohnson, MCMallion, KBMcCormick, JMcTaggart, FReid, ACSmith, GJTaylor, MJ Synthesis and activity of a novel series of 3-biarylquinuclidine squalene synthase inhibitors. J Med Chem39:2971-9 (1996) 
 
Squalene synthase
Name:Squalene synthase
Type:PROTEIN
Mol. Mass.:48109.41
Organism:Rattus norvegicus
Description:ChEMBL_1336736
Residue:416
BDBM50052343
NameBDBM50052343
Synonyms:3-Biphenyl-4-ylethynyl-1-aza-bicyclo[2.2.2]octan-3-ol | CHEMBL317462
TypeSmall organic molecule
Emp. Form.C21H21NO
Mol. Mass.303.3975
SMILESOC1(CN2CCC1CC2)C#Cc1ccc(cc1)-c1ccccc1