Reaction Details
TargetCoagulation factor XI
LigandBDBM50525762
Substrate/Competitorn/a
Meas. Tech.ChEMBL_1898062 (CHEMBL4400097)
Ki 0.270000±n/a nM
Citation Clark, CGRossi, KACorte, JRFang, TSmallheer, JMDe Lucca, INirschl, DSOrwat, MJPinto, DJPHu, ZWang, YYang, WJeon, YEwing, WRMyers, JESheriff, SLou, ZBozarth, JMWu, YRendina, AHarper, TZheng, JXin, BXiang, QLuettgen, JMSeiffert, DAWexler, RRLam, PYS Structure based design of macrocyclic factor XIa inhibitors: Discovery of cyclic P1 linker moieties with improved oral bioavailability. Bioorg Med Chem Lett29:0 (2019) 
 
Coagulation factor XI
Name:Coagulation factor XI
Type:Enzyme
Mol. Mass.:70130.58
Organism:Homo sapiens (Human)
Description:P03951
Residue:625
BDBM50525762
NameBDBM50525762
Synonyms:CHEMBL4467360
TypeSmall organic molecule
Emp. Form.C28H25Cl2F2N5O5
Mol. Mass.620.431
SMILESCOC(=O)Nc1ccc2-c3nc([nH]c3Cl)[C@H](C\C=C\CCC(=O)Nc2c1)N1CC[C@@H](OC1=O)c1c(F)ccc(Cl)c1F