Reaction Details
TargetCoagulation factor XI
LigandBDBM50542735
Substrate/Competitorn/a
Meas. Tech.ChEMBL_1987832 (CHEMBL4621379)
IC50 6.0±n/a nM
Citation Lorthiois, ERoache, JBarnes-Seeman, DAltmann, EHassiepen, UTurner, GDuvadie, RHornak, VKarki, RGSchiering, NWeihofen, WAPerruccio, FCalhoun, AFazal, TDedic, DDurand, CDussauge, SFettis, KTritsch, FDentel, CDruet, ALiu, DKirman, LLachal, JNamoto, KBevan, DMo, RMonnet, GMuller, LZessis, RHuang, XLindsley, LCurrie, TChiu, YHFridrich, CDelgado, PWang, SHollis-Symynkywicz, MBerghausen, JWilliams, ELiu, HLiang, GKim, HHoffmann, PHein, ARamage, PD'Arcy, AHarlfinger, SRenatus, MRuedisser, SFeldman, DElliott, JSedrani, RMaibaum, JAdams, CM Structure-Based Design and Preclinical Characterization of Selective and Orally Bioavailable Factor XIa Inhibitors: Demonstrating the Power of an Integrated S1 Protease Family Approach. J Med Chem63:8088-8113 (2020) 
 
Coagulation factor XI
Name:Coagulation factor XI
Type:Enzyme
Mol. Mass.:70130.58
Organism:Homo sapiens (Human)
Description:P03951
Residue:625
BDBM50542735
NameBDBM50542735
Synonyms:CHEMBL4635286
TypeSmall organic molecule
Emp. Form.C28H30N2O3
Mol. Mass.442.5494
SMILESCC(C)c1cc(CCN2CCc3cccc(C(O)=O)c23)cc(c1)-c1ccc2OC[C@@H](N)c2c1