Reaction Details
TargetPlasma kallikrein
LigandBDBM50542740
Substrate/Competitorn/a
Meas. Tech.ChEMBL_1987837 (CHEMBL4621384)
IC50 2.0±n/a nM
Citation Lorthiois, ERoache, JBarnes-Seeman, DAltmann, EHassiepen, UTurner, GDuvadie, RHornak, VKarki, RGSchiering, NWeihofen, WAPerruccio, FCalhoun, AFazal, TDedic, DDurand, CDussauge, SFettis, KTritsch, FDentel, CDruet, ALiu, DKirman, LLachal, JNamoto, KBevan, DMo, RMonnet, GMuller, LZessis, RHuang, XLindsley, LCurrie, TChiu, YHFridrich, CDelgado, PWang, SHollis-Symynkywicz, MBerghausen, JWilliams, ELiu, HLiang, GKim, HHoffmann, PHein, ARamage, PD'Arcy, AHarlfinger, SRenatus, MRuedisser, SFeldman, DElliott, JSedrani, RMaibaum, JAdams, CM Structure-Based Design and Preclinical Characterization of Selective and Orally Bioavailable Factor XIa Inhibitors: Demonstrating the Power of an Integrated S1 Protease Family Approach. J Med Chem63:8088-8113 (2020) 
 
Plasma kallikrein
Name:Plasma kallikrein
Type:Protein
Mol. Mass.:71391.16
Organism:Homo sapiens (Human)
Description:P03952
Residue:638
BDBM50542740
NameBDBM50542740
Synonyms:CHEMBL4646398
TypeSmall organic molecule
Emp. Form.C28H30N2O4
Mol. Mass.458.5488
SMILESCC(C)c1cc(cc(c1)-c1ccc2OC[C@@H](N)c2c1)C(O)CN1CCc2cccc(C(O)=O)c12