Reaction Details
TargetCoagulation factor XI
LigandBDBM50542741
Substrate/Competitorn/a
Meas. Tech.ChEMBL_1987832 (CHEMBL4621379)
IC50<0.700000±n/a nM
Citation Lorthiois, ERoache, JBarnes-Seeman, DAltmann, EHassiepen, UTurner, GDuvadie, RHornak, VKarki, RGSchiering, NWeihofen, WAPerruccio, FCalhoun, AFazal, TDedic, DDurand, CDussauge, SFettis, KTritsch, FDentel, CDruet, ALiu, DKirman, LLachal, JNamoto, KBevan, DMo, RMonnet, GMuller, LZessis, RHuang, XLindsley, LCurrie, TChiu, YHFridrich, CDelgado, PWang, SHollis-Symynkywicz, MBerghausen, JWilliams, ELiu, HLiang, GKim, HHoffmann, PHein, ARamage, PD'Arcy, AHarlfinger, SRenatus, MRuedisser, SFeldman, DElliott, JSedrani, RMaibaum, JAdams, CM Structure-Based Design and Preclinical Characterization of Selective and Orally Bioavailable Factor XIa Inhibitors: Demonstrating the Power of an Integrated S1 Protease Family Approach. J Med Chem63:8088-8113 (2020) 
 
Coagulation factor XI
Name:Coagulation factor XI
Type:Enzyme
Mol. Mass.:70130.58
Organism:Homo sapiens (Human)
Description:P03951
Residue:625
BDBM50542741
NameBDBM50542741
Synonyms:CHEMBL4647950
TypeSmall organic molecule
Emp. Form.C28H28N2O4
Mol. Mass.456.5329
SMILESCC(C)c1cc(cc(c1)-c1ccc2OC[C@@H](N)c2c1)C(O)Cn1ccc2cccc(C(O)=O)c12