Reaction Details
TargetKetohexokinase
LigandBDBM319582
Substrate/Competitorn/a
Meas. Tech.ChEMBL_2022242 (CHEMBL4676055)
IC50 1.000000±n/a nM
Citation Futatsugi, KSmith, ACTu, MRaymer, BAhn, KCoffey, SBDowling, MSFernando, DPGutierrez, JAHuard, KJasti, JKalgutkar, ASKnafels, JDPandit, JParris, KDPerez, SPfefferkorn, JAPrice, DARyder, TShavnya, AStock, IATsai, ASTesz, GJThuma, BAWeng, YWisniewska, HMXing, GZhou, JMagee, TV Discovery of PF-06835919: A Potent Inhibitor of Ketohexokinase (KHK) for the Treatment of Metabolic Disorders Driven by the Overconsumption of Fructose. J Med Chem63:13546-13560 (2020) 
 
Ketohexokinase
Name:Ketohexokinase
Type:Enzyme Catalytic Domain
Mol. Mass.:32521.64
Organism:Homo sapiens (Human)
Description:n/a
Residue:298
BDBM319582
NameBDBM319582
Synonyms:US10174007, Example 1 US10988463, Example 1 | US11634410, Example 1
TypeSmall organic molecule
Emp. Form.C18H19F3N4O3
Mol. Mass.396.3637
SMILESC[C@H]1[C@H](O)CN1c1nc(cc(c1C#N)C(F)(F)F)N1C[C@H]2[C@H](CC(O)=O)[C@H]2C1