Reaction Details
TargetCoagulation factor XI
LigandBDBM50582800
Substrate/Competitorn/a
Meas. Tech.ChEMBL_2155676 (CHEMBL5040336)
Ki 0.170000±n/a nM
Citation Dilger, AKPabbisetty, KBCorte, JRDe Lucca, IFang, TYang, WPinto, DJPWang, YZhu, YMathur, ALi, JHou, XSmith, DSun, DZhang, HKrishnananthan, SWu, DRMyers, JESheriff, SRossi, KAChacko, SZheng, JJGalella, MAZiemba, TDierks, EABozarth, JMWu, YCrain, EWong, PCLuettgen, JMWexler, RREwing, WR Discovery of Milvexian, a High-Affinity, Orally Bioavailable Inhibitor of Factor XIa in Clinical Studies for Antithrombotic Therapy. J Med Chem65:1770-1785 (2022) 
 
Coagulation factor XI
Name:Coagulation factor XI
Type:Enzyme
Mol. Mass.:70130.58
Organism:Homo sapiens (Human)
Description:P03951
Residue:625
BDBM50582800
NameBDBM50582800
Synonyms:CHEMBL5093567
TypeSmall organic molecule
Emp. Form.C28H25Cl2N9O2
Mol. Mass.590.463
SMILESC[C@@H]1CCC[C@@H](c2cc(ccn2)-c2c(NC1=O)cnn2C)n1cnc(cc1=O)-c1cc(Cl)ccc1-n1cc(Cl)nn1