Reaction Details
TargetProtein kinase C alpha type
LigandBDBM16316
Substrate/Competitorn/a
Meas. Tech.ChEMBL_429708 (CHEMBL904282)
IC50>10000±n/a nM
Citation Leftheris, KAhmed, GChan, RDyckman, AJHussain, ZHo, KHynes, JLetourneau, JLi, WLin, SMetzger, AMoriarty, KJRiviello, CShimshock, YWen, JWityak, JWrobleski, STWu, HWu, JDesai, MGillooly, KMLin, THLoo, DMcIntyre, KWPitt, SShen, DRShuster, DJZhang, RDiller, DDoweyko, ASack, JBaldwin, JBarrish, JDodd, JHenderson, IKanner, SSchieven, GLWebb, M The discovery of orally active triaminotriazine aniline amides as inhibitors of p38 MAP kinase. J Med Chem47:6283-91 (2004) 
 
Protein kinase C alpha type
Name:Protein kinase C alpha type
Type:Enzyme
Mol. Mass.:76755.65
Organism:Homo sapiens (Human)
Description:The recombinant human PKC enzymes were produced using a baculovirus expression system in SF9 cells
Residue:672
BDBM16316
NameBDBM16316
Synonyms:3-({4-[(2,2-dimethylpropyl)(methyl)amino]-6-(4-methyl-1,4-diazepan-1-yl)-1,3,5-triazin-2-yl}amino)-N-methoxy-4-methylbenzamide triaminotriazine aniline amide inhibitor, 1
TypeSmall organic molecule
Emp. Form.C24H38N8O2
Mol. Mass.470.6109
SMILESCONC(=O)c1ccc(C)c(Nc2nc(nc(n2)N2CCCN(C)CC2)N(C)CC(C)(C)C)c1