Reaction Details
TargetTyrosine-protein phosphatase YopH
LigandBDBM50177318
Substrate/Competitorn/a
Meas. Tech.ChEMBL_331859 (CHEMBL865877)
IC50 550±n/a nM
Citation Cho, SYBaek, JYHan, SSKang, SKHa, JDAhn, JHLee, JDKim, KRCheon, HGRhee, SDYang, SDYon, GHPak, CSChoi, JK PTP-1B inhibitors: cyclopenta[d][1,2]-oxazine derivatives. Bioorg Med Chem Lett16:499-502 (2005) 
 
Tyrosine-protein phosphatase YopH
Name:Tyrosine-protein phosphatase YopH
Type:PROTEIN
Mol. Mass.:50951.99
Organism:Yersinia enterocolitica
Description:ChEMBL_965525
Residue:468
BDBM50177318
NameBDBM50177318
Synonyms:2-(4-(7-(4-tetradecylbenzoyl)cyclopenta[d][1,2]oxazin-4-yl)phenoxy)acetic acid | CHEMBL200117
TypeSmall organic molecule
Emp. Form.C36H43NO5
Mol. Mass.569.7303
c1ccc(cc1)C(=O)c1ccc2c(nocc12)-c1ccc(OCC(O)=O)cc1