Reaction Details
TargetTyrosine-protein phosphatase YopH
LigandBDBM50177316
Substrate/Competitorn/a
Meas. Tech.ChEMBL_331859 (CHEMBL865877)
IC50 1190±n/a nM
Citation Cho, SYBaek, JYHan, SSKang, SKHa, JDAhn, JHLee, JDKim, KRCheon, HGRhee, SDYang, SDYon, GHPak, CSChoi, JK PTP-1B inhibitors: cyclopenta[d][1,2]-oxazine derivatives. Bioorg Med Chem Lett16:499-502 (2005) 
 
Tyrosine-protein phosphatase YopH
Name:Tyrosine-protein phosphatase YopH
Type:PROTEIN
Mol. Mass.:50951.99
Organism:Yersinia enterocolitica
Description:ChEMBL_965525
Residue:468
BDBM50177316
NameBDBM50177316
Synonyms:2-(4-(7-(4-(aminomethyl)benzoyl)cyclopenta[d][1,2]oxazin-4-yl)phenoxy)acetic acid | CHEMBL202197
TypeSmall organic molecule
Emp. Form.C23H18N2O5
Mol. Mass.402.3994
SMILESNCc1ccc(cc1)C(=O)c1ccc2c(nocc12)-c1ccc(OCC(O)=O)cc1