Reaction Details
TargetTyrosine-protein phosphatase non-receptor type 1
LigandBDBM50177324
Substrate/Competitorn/a
Meas. Tech.ChEMBL_331857 (CHEMBL865873)
IC50 270±n/a nM
Citation Cho, SYBaek, JYHan, SSKang, SKHa, JDAhn, JHLee, JDKim, KRCheon, HGRhee, SDYang, SDYon, GHPak, CSChoi, JK PTP-1B inhibitors: cyclopenta[d][1,2]-oxazine derivatives. Bioorg Med Chem Lett16:499-502 (2005) 
 
Tyrosine-protein phosphatase non-receptor type 1
Name:Tyrosine-protein phosphatase non-receptor type 1
Type:Protein phosphatase
Mol. Mass.:49963.76
Organism:Homo sapiens (Human)
Description:Human recombinant GST-fusion PTP1B (1-435).
Residue:435
BDBM50177324
NameBDBM50177324
Synonyms:2-(4-(7-pentadecanoylcyclopenta[d][1,2]oxazin-4-yl)phenoxy)acetic acid | CHEMBL371026
TypeSmall organic molecule
Emp. Form.C30H39NO5
Mol. Mass.493.6344
(=O)c1ccc2c(nocc12)-c1ccc(OCC(O)=O)cc1