Reaction Details
TargetRenin
LigandBDBM50267295
Substrate/Competitorn/a
Meas. Tech.ChEMBL_563306 (CHEMBL981942)
Ki>20000±n/a nM
Citation Degoey, DAGrampovnik, DJFlentge, CAFlosi, WJChen, HJYeung, CMRandolph, JTKlein, LLDekhtyar, TColletti, LMarsh, KCStoll, VMamo, MMorfitt, DCNguyen, BSchmidt, JMSwanson, SJMo, HKati, WMMolla, AKempf, DJ 2-Pyridyl P1'-substituted symmetry-based human immunodeficiency virus protease inhibitors (A-792611 and A-790742) with potential for convenient dosing and reduced side effects. J Med Chem52:2571-86 (2009) 
 
Renin
Name:Renin
Type:Enzyme
Mol. Mass.:45058.99
Organism:Homo sapiens (Human)
Description:n/a
Residue:406
BDBM50267295
NameBDBM50267295
Synonyms:CHEMBL470508 | Methyl (S)-1-((2R,4S,5S)-4-Hydroxy-5-((S)-2-(3-((6-(2-hydroxypropan-2-yl)pyridin-2-yl)methyl)-2-oxoimidazolidin-1-yl)-3,3-dimethylbutanamido)-6-phenyl-1-(4-(pyridin-2-yl)phenyl)hexan-2-ylamino)-3,3-dimethyl-1-oxobutan-2-ylcarbamate
TypeSmall organic molecule
Emp. Form.C49H65N7O7
Mol. Mass.864.0831
SMILESCOC(=O)N[C@H](C(=O)N[C@@H](C[C@H](O)[C@H](Cc1ccccc1)NC(=O)[C@@H](N1CCN(Cc2cccc(n2)C(C)(C)O)C1=O)C(C)(C)C)Cc1ccc(cc1)-c1ccccn1)C(C)(C)C