Reaction Details
TargetProteasome subunit beta type-8
LigandBDBM50277816
Substrate/Competitorn/a
Meas. Tech.ChEMBL_502029 (CHEMBL981240)
IC50 36±n/a nM
Citation Zhou, HJAujay, MABennett, MKDajee, MDemo, SDFang, YHo, MNJiang, JKirk, CJLaidig, GJLewis, ERLu, YMuchamuel, TParlati, FRing, EShenk, KDShields, JShwonek, PJStanton, TSun, CMSylvain, CWoo, TMYang, J Design and synthesis of an orally bioavailable and selective peptide epoxyketone proteasome inhibitor (PR-047). J Med Chem52:3028-38 (2009) 
 
Proteasome subunit beta type-8
Name:Proteasome subunit beta type-8
Type:PROTEIN
Mol. Mass.:30357.49
Organism:Homo sapiens (Human)
Description:ChEMBL_1446797
Residue:276
BDBM50277816
NameBDBM50277816
Synonyms:3-methoxy-N-((S)-3-methoxy-1-((S)-3-methoxy-1-((S)-1-((R)-2-methyloxiran-2-yl)-1-oxo-3-phenylpropan-2-ylamino)-1-oxopropan-2-ylamino)-1-oxopropan-2-yl)isoxazole-5-carboxamide | CHEMBL483739
TypeSmall organic molecule
Emp. Form.C25H32N4O9
Mol. Mass.532.543
SMILESCOC[C@H](NC(=O)[C@H](COC)NC(=O)c1cc(OC)no1)C(=O)N[C@@H](Cc1ccccc1)C(=O)[C@@]1(C)CO1