Reaction Details
TargetProteasome subunit beta type-8
LigandBDBM50277780
Substrate/Competitorn/a
Meas. Tech.ChEMBL_502029 (CHEMBL981240)
IC50 41±n/a nM
Citation Zhou, HJAujay, MABennett, MKDajee, MDemo, SDFang, YHo, MNJiang, JKirk, CJLaidig, GJLewis, ERLu, YMuchamuel, TParlati, FRing, EShenk, KDShields, JShwonek, PJStanton, TSun, CMSylvain, CWoo, TMYang, J Design and synthesis of an orally bioavailable and selective peptide epoxyketone proteasome inhibitor (PR-047). J Med Chem52:3028-38 (2009) 
 
Proteasome subunit beta type-8
Name:Proteasome subunit beta type-8
Type:PROTEIN
Mol. Mass.:30357.49
Organism:Homo sapiens (Human)
Description:ChEMBL_1446797
Residue:276
BDBM50277780
NameBDBM50277780
Synonyms:5-ethoxy-N-((S)-3-methoxy-1-((S)-3-methoxy-1-((S)-4-methyl-1-((R)-2-methyloxiran-2-yl)-1-oxopentan-2-ylamino)-1-oxopropan-2-ylamino)-1-oxopropan-2-yl)isoxazole-3-carboxamide | CHEMBL484004
TypeSmall organic molecule
Emp. Form.C23H36N4O9
Mol. Mass.512.5533
SMILESCCOc1cc(no1)C(=O)N[C@@H](COC)C(=O)N[C@@H](COC)C(=O)N[C@@H](CC(C)C)C(=O)[C@@]1(C)CO1