Reaction Details
TargetSerine/threonine-protein kinase D1
LigandBDBM50324297
Substrate/Competitorn/a
Meas. Tech.ChEMBL_650128 (CHEMBL1219826)
IC50 0.400000±n/a nM
Citation Meredith, ELArdayfio, OBeattie, KDobler, MREnyedy, IGaul, CHosagrahara, VJewell, CKoch, KLee, WLehmann, HMcKinsey, TAMiranda, KPagratis, NPancost, MPatnaik, APhan, DPlato, CQian, MRajaraman, VRao, CRozhitskaya, ORuppen, TShi, JSiska, SJSpringer, Cvan Eis, MVega, RBvon Matt, AYang, LYoon, TZhang, JHZhu, NMonovich, LG Identification of orally available naphthyridine protein kinase D inhibitors. J Med Chem53:5400-21 (2010) 
 
Serine/threonine-protein kinase D1
Name:Serine/threonine-protein kinase D1
Type:Serine/threonine-protein kinase
Mol. Mass.:101705.07
Organism:Homo sapiens (Human)
Description:gi_115529463
Residue:912
BDBM50324297
NameBDBM50324297
Synonyms:4-(1-Piperazin-1-yl[2,6]naphthyridin-3-yl)pyridin-2-yl](tetrahydropyran-4-yl)amine | CHEMBL1215711
TypeSmall organic molecule
Emp. Form.C22H26N6O
Mol. Mass.390.4814
SMILESC1CN(CCN1)c1nc(cc2cnccc12)-c1ccnc(NC2CCOCC2)c1