Reaction Details
TargetProtein kinase C alpha type
LigandBDBM3033
Substrate/Competitorn/a
Meas. Tech.ChEMBL_650126 (CHEMBL1219824)
IC50 3.7±n/a nM
Citation Meredith, ELArdayfio, OBeattie, KDobler, MREnyedy, IGaul, CHosagrahara, VJewell, CKoch, KLee, WLehmann, HMcKinsey, TAMiranda, KPagratis, NPancost, MPatnaik, APhan, DPlato, CQian, MRajaraman, VRao, CRozhitskaya, ORuppen, TShi, JSiska, SJSpringer, Cvan Eis, MVega, RBvon Matt, AYang, LYoon, TZhang, JHZhu, NMonovich, LG Identification of orally available naphthyridine protein kinase D inhibitors. J Med Chem53:5400-21 (2010) 
 
Protein kinase C alpha type
Name:Protein kinase C alpha type
Type:Enzyme
Mol. Mass.:76755.65
Organism:Homo sapiens (Human)
Description:The recombinant human PKC enzymes were produced using a baculovirus expression system in SF9 cells
Residue:672
BDBM3033
NameBDBM3033
Synonyms:3-{23-methyl-14-oxo-3,13,23-triazahexacyclo[14.7.0.0^{2,10}.0^{4,9}.0^{11,15}.0^{17,22}]tricosa-1(16),2(10),4(9),5,7,11(15),17,19,21-nonaen-3-yl}propanenitrile Go 6976 | Indolocarbazole deriv.
TypeSmall organic molecule
Emp. Form.C24H18N4O
Mol. Mass.378.4259
SMILESCn1c2ccccc2c2c3C(=O)NCc3c3c4ccccc4n(CCC#N)c3c12