Reaction Details
TargetSerine/threonine-protein kinase D1
LigandBDBM50324312
Substrate/Competitorn/a
Meas. Tech.ChEMBL_650128 (CHEMBL1219826)
IC50 2±n/a nM
Citation Meredith, ELArdayfio, OBeattie, KDobler, MREnyedy, IGaul, CHosagrahara, VJewell, CKoch, KLee, WLehmann, HMcKinsey, TAMiranda, KPagratis, NPancost, MPatnaik, APhan, DPlato, CQian, MRajaraman, VRao, CRozhitskaya, ORuppen, TShi, JSiska, SJSpringer, Cvan Eis, MVega, RBvon Matt, AYang, LYoon, TZhang, JHZhu, NMonovich, LG Identification of orally available naphthyridine protein kinase D inhibitors. J Med Chem53:5400-21 (2010) 
 
Serine/threonine-protein kinase D1
Name:Serine/threonine-protein kinase D1
Type:Serine/threonine-protein kinase
Mol. Mass.:101705.07
Organism:Homo sapiens (Human)
Description:gi_115529463
Residue:912
BDBM50324312
NameBDBM50324312
Synonyms:1-{3-[2-(Tetrahydropyran-4-ylamino)pyridin-4-yl][2,6]naphthyridin-1-yl}piperidine-4-carboxylic Acid Isobutylamide | CHEMBL1214858
TypeSmall organic molecule
Emp. Form.C28H36N6O2
Mol. Mass.488.6244
SMILESCC(C)CNC(=O)C1CCN(CC1)c1nc(cc2cnccc12)-c1ccnc(NC2CCOCC2)c1