Reaction Details
TargetMast/stem cell growth factor receptor Kit
LigandBDBM50362982
Substrate/Competitorn/a
Meas. Tech.ChEMBL_800418 (CHEMBL1948349)
IC50 63±n/a nM
Citation Duffey, MOVos, TJAdams, RAlley, JAnthony, JBarrett, CBharathan, IBowman, DBump, NJChau, RCullis, CDriscoll, DLElder, AForsyth, NFrazer, JGuo, JGuo, LHyer, MLJanowick, DKulkarni, BLai, SJLasky, KLi, GLi, JLiao, DLittle, JPeng, BQian, MGReynolds, DJRezaei, MScott, MPSells, TBShinde, VShi, QJSintchak, MDSoucy, FSprott, KTStroud, SGNestor, MVisiers, IWeatherhead, GYe, YD'Amore, N Discovery of a potent and orally bioavailable benzolactam-derived inhibitor of Polo-like kinase 1 (MLN0905). J Med Chem55:197-208 (2012) 
 
Mast/stem cell growth factor receptor Kit
Name:Mast/stem cell growth factor receptor Kit
Type:Protein
Mol. Mass.:109869.37
Organism:Homo sapiens (Human)
Description:P10721
Residue:976
BDBM50362982
NameBDBM50362982
Synonyms:CHEMBL1945170
TypeSmall organic molecule
Emp. Form.C23H24ClN5S
Mol. Mass.437.988
SMILESCN(C)CCCc1cccc(Nc2ncc3CC(=S)Nc4cc(Cl)ccc4-c3n2)c1