Reaction Details
TargetPlatelet-derived growth factor receptor beta
LigandBDBM50362980
Substrate/Competitorn/a
Meas. Tech.ChEMBL_800415 (CHEMBL1948346)
IC50 93±n/a nM
Citation Duffey, MOVos, TJAdams, RAlley, JAnthony, JBarrett, CBharathan, IBowman, DBump, NJChau, RCullis, CDriscoll, DLElder, AForsyth, NFrazer, JGuo, JGuo, LHyer, MLJanowick, DKulkarni, BLai, SJLasky, KLi, GLi, JLiao, DLittle, JPeng, BQian, MGReynolds, DJRezaei, MScott, MPSells, TBShinde, VShi, QJSintchak, MDSoucy, FSprott, KTStroud, SGNestor, MVisiers, IWeatherhead, GYe, YD'Amore, N Discovery of a potent and orally bioavailable benzolactam-derived inhibitor of Polo-like kinase 1 (MLN0905). J Med Chem55:197-208 (2012) 
 
Platelet-derived growth factor receptor beta
Name:Platelet-derived growth factor receptor beta
Type:Enzyme
Mol. Mass.:123922.25
Organism:Homo sapiens (Human)
Description:P09619
Residue:1106
BDBM50362980
NameBDBM50362980
Synonyms:CHEMBL1945172
TypeSmall organic molecule
Emp. Form.C23H23Cl2N5S
Mol. Mass.472.433
SMILESCN(C)CCCc1ccc(Cl)c(Nc2ncc3CC(=S)Nc4cc(Cl)ccc4-c3n2)c1