Reaction Details
TargetSerine/threonine-protein kinase PLK3
LigandBDBM50362985
Substrate/Competitorn/a
Meas. Tech.ChEMBL_800413 (CHEMBL1948344)
IC50 5±n/a nM
Citation Duffey, MOVos, TJAdams, RAlley, JAnthony, JBarrett, CBharathan, IBowman, DBump, NJChau, RCullis, CDriscoll, DLElder, AForsyth, NFrazer, JGuo, JGuo, LHyer, MLJanowick, DKulkarni, BLai, SJLasky, KLi, GLi, JLiao, DLittle, JPeng, BQian, MGReynolds, DJRezaei, MScott, MPSells, TBShinde, VShi, QJSintchak, MDSoucy, FSprott, KTStroud, SGNestor, MVisiers, IWeatherhead, GYe, YD'Amore, N Discovery of a potent and orally bioavailable benzolactam-derived inhibitor of Polo-like kinase 1 (MLN0905). J Med Chem55:197-208 (2012) 
 
Serine/threonine-protein kinase PLK3
Name:Serine/threonine-protein kinase PLK3
Type:Serine/threonine-protein kinase
Mol. Mass.:71655.17
Organism:Homo sapiens (Human)
Description:Enzyme assays were using PLK3 purified from baculovirus-infected Trichoplusia ni cells expressing full-length PLK3.
Residue:646
BDBM50362985
NameBDBM50362985
Synonyms:CHEMBL1945502
TypeSmall organic molecule
Emp. Form.C24H26ClN5OS
Mol. Mass.468.014
SMILESCOc1ccc(Nc2ncc3CC(=S)Nc4cc(Cl)ccc4-c3n2)cc1CCCN(C)C