Reaction Details
TargetP-selectin
LigandBDBM50061127
Substrate/Competitorn/a
Meas. Tech.ChEMBL_200027 (CHEMBL810716)
IC50 2500±n/a nM
Citation Marinier, AMartel, ABanville, JBachand, CRemillard, RLapointe, PTurmel, BMenard, MHarte, WEWright, JJTodderud, GTramposch, KMBajorath, JHollenbaugh, DAruffo, A Sulfated galactocerebrosides as potential antiinflammatory agents. J Med Chem40:3234-47 (1997) 
 
P-selectin
Name:P-selectin
Type:PROTEIN
Mol. Mass.:90834.61
Organism:Homo sapiens (Human)
Description:ChEMBL_1438999
Residue:830
BDBM50061127
NameBDBM50061127
Synonyms:(2S,3R,4E)-2-(Hexadecanoylamino)-3-hydroxy-1-[[2-O-(sodium oxysulfonyl)-beta-D-galactopyranosyl]oxy]-4-octadecene | CHEMBL326654
TypeSmall organic molecule
Emp. Form.C40H76NO11S
Mol. Mass.779.097
(=O)N[C@@H](COC1OC(CO)C(O)C(O)C1OS([O-])(=O)=O)[C@H](O)\C=C\CCCCCCCCCCCCC