Reaction Details
TargetCyclin-dependent kinase 2
LigandBDBM50150701
Substrate/Competitorn/a
Meas. Tech.ChEMBL_305060 (CHEMBL831696)
IC50 2100±n/a nM
Citation Engler, TAHenry, JRMalhotra, SCunningham, BFurness, KBrozinick, JBurkholder, TPClay, MPClayton, JDiefenbacher, CHawkins, EIversen, PWLi, YLindstrom, TDMarquart, ALMcLean, JMendel, DMisener, EBriere, DO'Toole, JCPorter, WJQueener, SReel, JKOwens, RABrier, RAEessalu, TEWagner, JRCampbell, RMVaughn, R Substituted 3-imidazo[1,2-a]pyridin-3-yl- 4-(1,2,3,4-tetrahydro-[1,4]diazepino-[6,7,1-hi]indol-7-yl)pyrrole-2,5-diones as highly selective and potent inhibitors of glycogen synthase kinase-3. J Med Chem47:3934-7 (2004) 
 
Cyclin-dependent kinase 2
Name:Cyclin-dependent kinase 2
Type:Enzyme Subunit
Mol. Mass.:33938.17
Organism:Homo sapiens (Human)
Description:P24941
Residue:298
BDBM50150701
NameBDBM50150701
Synonyms:7-(4-(H-imidazo[1,2-a]pyridin-3-yl)-2,5-dioxo-2,5-dihydro-1H-pyrrol-3-yl)-N,N-dimethyl-3,4-dihydro-[1,4]diazepino[6,7,1-hi]indole-2(1H)-carboxamide CHEMBL362814
TypeSmall organic molecule
Emp. Form.C25H22N6O3
Mol. Mass.454.4806
SMILESCN(C)C(=O)N1CCn2cc(C3=C(C(=O)NC3=O)c3cnc4ccccn34)c3cccc(C1)c23