Reaction Details
TargetHistamine H4 receptor
LigandBDBM50315317
Substrate/Competitorn/a
Meas. Tech.ChEMBL_625969 (CHEMBL1103488)
IC50 111±n/a nM
Citation Cramp, SDyke, HJHiggs, CClark, DEGill, MSavy, PJennings, NPrice, SLockey, PMNorman, DPorres, SWilson, FJones, ARamsden, NMangano, RLeggate, DAndersson, MHale, R Identification and hit-to-lead exploration of a novel series of histamine H4 receptor inverse agonists. Bioorg Med Chem Lett20:2516-9 (2010) 
 
Histamine H4 receptor
Name:Histamine H4 receptor
Type:G Protein-Coupled Receptor (GPCR)
Mol. Mass.:44517.02
Organism:Homo sapiens (Human)
Description:Binding assays were using CHO cells stably expressing hH4R receptors.
Residue:390
BDBM50315317
NameBDBM50315317
Synonyms:8-chloro-4-((1S,4S)-5-methyl-2,5-diazabicyclo[2.2.1]heptan-2-yl)benzofuro[3,2-d]pyrimidine | CHEMBL1092332
TypeSmall organic molecule
Emp. Form.C16H15ClN4O
Mol. Mass.314.77
SMILESCN1C[C@@H]2C[C@H]1CN2c1ncnc2c1oc1ccc(Cl)cc21