Reaction Details
TargetHistamine H4 receptor
LigandBDBM50315321
Substrate/Competitorn/a
Meas. Tech.ChEMBL_625969 (CHEMBL1103488)
IC50 21000±n/a nM
Citation Cramp, SDyke, HJHiggs, CClark, DEGill, MSavy, PJennings, NPrice, SLockey, PMNorman, DPorres, SWilson, FJones, ARamsden, NMangano, RLeggate, DAndersson, MHale, R Identification and hit-to-lead exploration of a novel series of histamine H4 receptor inverse agonists. Bioorg Med Chem Lett20:2516-9 (2010) 
 
Histamine H4 receptor
Name:Histamine H4 receptor
Type:G Protein-Coupled Receptor (GPCR)
Mol. Mass.:44517.02
Organism:Homo sapiens (Human)
Description:Binding assays were using CHO cells stably expressing hH4R receptors.
Residue:390
BDBM50315321
NameBDBM50315321
Synonyms:1-(8-chlorobenzofuro[3,2-d]pyrimidin-4-yl)-N,N-dimethylpyrrolidin-3-amine | CHEMBL1088888
TypeSmall organic molecule
Emp. Form.C16H17ClN4O
Mol. Mass.316.785
SMILESCN(C)C1CCN(C1)c1ncnc2c3cc(Cl)ccc3oc12