Reaction Details
TargetHistamine H4 receptor
LigandBDBM50315348
Substrate/Competitorn/a
Meas. Tech.ChEMBL_625969 (CHEMBL1103488)
IC50 1±n/a nM
Citation Cramp, SDyke, HJHiggs, CClark, DEGill, MSavy, PJennings, NPrice, SLockey, PMNorman, DPorres, SWilson, FJones, ARamsden, NMangano, RLeggate, DAndersson, MHale, R Identification and hit-to-lead exploration of a novel series of histamine H4 receptor inverse agonists. Bioorg Med Chem Lett20:2516-9 (2010) 
 
Histamine H4 receptor
Name:Histamine H4 receptor
Type:G Protein-Coupled Receptor (GPCR)
Mol. Mass.:44517.02
Organism:Homo sapiens (Human)
Description:Binding assays were using CHO cells stably expressing hH4R receptors.
Residue:390
BDBM50315348
NameBDBM50315348
Synonyms:(R)-8-chloro-4-(3-(methylamino)pyrrolidin-1-yl)benzofuro[3,2-d]pyrimidin-2-amine | CHEMBL1091874
TypeSmall organic molecule
Emp. Form.C15H16ClN5O
Mol. Mass.317.773
SMILESCN[C@@H]1CCN(C1)c1nc(N)nc2c3cc(Cl)ccc3oc12