Reaction Details
TargetProlyl hydroxylase EGLN3
LigandBDBM50385786
Substrate/Competitorn/a
Meas. Tech.ChEMBL_823545 (CHEMBL2045988)
IC50 47±n/a nM
Citation Vachal, PMiao, SPierce, JMGuiadeen, DColandrea, VJWyvratt, MJSalowe, SPSonatore, LMMilligan, JAHajdu, RGollapudi, AKeohane, CALingham, RBMandala, SMDeMartino, JATong, XWolff, MSteinhuebel, DKieczykowski, GRFleitz, FJChapman, KAthanasopoulos, JAdam, GAkyuz, CDJena, DKLusen, JWMeng, JStein, BDXia, LSherer, ECHale, JJ 1,3,8-Triazaspiro[4.5]decane-2,4-diones as efficacious pan-inhibitors of hypoxia-inducible factor prolyl hydroxylase 1-3 (HIF PHD1-3) for the treatment of anemia. J Med Chem55:2945-59 (2012) 
 
Prolyl hydroxylase EGLN3
Name:Prolyl hydroxylase EGLN3
Type:Protein
Mol. Mass.:27265.54
Organism:Homo sapiens (Human)
Description:Q9H6Z9
Residue:239
BDBM50385786
NameBDBM50385786
Synonyms:CHEMBL2041173
TypeSmall organic molecule
Emp. Form.C32H30N8O3
Mol. Mass.574.6324
SMILESCOc1cc(ncn1)N1C(=O)N(C(=O)C11CCN(Cc2ncccc2C)CC1)c1ccc(cc1)-c1ccc2[nH]ncc2c1