Reaction Details
TargetProlyl hydroxylase EGLN3
LigandBDBM50385834
Substrate/Competitorn/a
Meas. Tech.ChEMBL_823545 (CHEMBL2045988)
IC50 97±n/a nM
Citation Vachal, PMiao, SPierce, JMGuiadeen, DColandrea, VJWyvratt, MJSalowe, SPSonatore, LMMilligan, JAHajdu, RGollapudi, AKeohane, CALingham, RBMandala, SMDeMartino, JATong, XWolff, MSteinhuebel, DKieczykowski, GRFleitz, FJChapman, KAthanasopoulos, JAdam, GAkyuz, CDJena, DKLusen, JWMeng, JStein, BDXia, LSherer, ECHale, JJ 1,3,8-Triazaspiro[4.5]decane-2,4-diones as efficacious pan-inhibitors of hypoxia-inducible factor prolyl hydroxylase 1-3 (HIF PHD1-3) for the treatment of anemia. J Med Chem55:2945-59 (2012) 
 
Prolyl hydroxylase EGLN3
Name:Prolyl hydroxylase EGLN3
Type:Protein
Mol. Mass.:27265.54
Organism:Homo sapiens (Human)
Description:Q9H6Z9
Residue:239
BDBM50385834
NameBDBM50385834
Synonyms:CHEMBL2043006
TypeSmall organic molecule
Emp. Form.C31H29N5O3
Mol. Mass.519.5937
SMILESCc1cccnc1CN1CCC2(CC1)N(C(=O)N(C2=O)c1ccc(cc1)-c1ccccc1)c1cc(O)ccn1