Reaction Details
TargetPotassium voltage-gated channel subfamily H member 2
LigandBDBM50385813
Substrate/Competitorn/a
Meas. Tech.ChEMBL_823549 (CHEMBL2045992)
IC50 6400±n/a nM
Citation Vachal, PMiao, SPierce, JMGuiadeen, DColandrea, VJWyvratt, MJSalowe, SPSonatore, LMMilligan, JAHajdu, RGollapudi, AKeohane, CALingham, RBMandala, SMDeMartino, JATong, XWolff, MSteinhuebel, DKieczykowski, GRFleitz, FJChapman, KAthanasopoulos, JAdam, GAkyuz, CDJena, DKLusen, JWMeng, JStein, BDXia, LSherer, ECHale, JJ 1,3,8-Triazaspiro[4.5]decane-2,4-diones as efficacious pan-inhibitors of hypoxia-inducible factor prolyl hydroxylase 1-3 (HIF PHD1-3) for the treatment of anemia. J Med Chem55:2945-59 (2012) 
 
Potassium voltage-gated channel subfamily H member 2
Name:Potassium voltage-gated channel subfamily H member 2
Type:Multi-pass membrane protein
Mol. Mass.:126672.65
Organism:Homo sapiens (Human)
Description:Q12809
Residue:1159
BDBM50385813
NameBDBM50385813
Synonyms:CHEMBL2043168
TypeSmall organic molecule
Emp. Form.C32H30N6O5
Mol. Mass.578.6178
SMILESCOc1cc(ncn1)N1C(=O)N(C(=O)C11CCN(Cc2ncccc2C)CC1)c1ccc(cc1)-c1ccc(cc1)C(O)=O