Reaction Details
TargetIntegrin alpha-L/Integrin beta-2/Intercellular adhesion molecule 1
LigandBDBM50199032
Substrate/Competitorn/a
Meas. Tech.ChEMBL_419414 (CHEMBL913014)
IC50 164±n/a nM
Citation Potin, DLaunay, MMonatlik, FMalabre, PFabreguettes, MFouquet, AMaillet, MNicolai, EDorgeret, LChevallier, FBesse, DDufort, MCaussade, FAhmad, SZStetsko, DKSkala, SDavis, PMBalimane, PPatel, KYang, ZMarathe, PPostelneck, JTownsend, RMGoldfarb, VSheriff, SEinspahr, HKish, KMalley, MFDiMarco, JDGougoutas, JZKadiyala, PCheney, DLTejwani, RWMurphy, DKMcintyre, KWYang, XChao, SLeith, LXiao, ZMathur, AChen, BCWu, DRTraeger, SCMcKinnon, MBarrish, JCRobl, JAIwanowicz, EJSuchard, SJDhar, TG Discovery and development of 5-[(5S,9R)-9-(4-cyanophenyl)-3-(3,5-dichlorophenyl)-1-methyl-2,4-dioxo-1,3,7-triazaspiro[4.4]non-7-yl-methyl]-3-thiophenecarboxylic acid (BMS-587101)--a small molecule antagonist of leukocyte function associated antigen-1. J Med Chem49:6946-9 (2006) 
 
Integrin alpha-L/Integrin beta-2/Intercellular adhesion molecule 1
Name:Integrin alpha-L/Integrin beta-2/Intercellular adhesion molecule 1
Type:n/a
Mol. Mass.:n/a
Description:ASSAY_ID of EBI is 97281
Components:This complex has 3 components.
Component 1
Name:Integrin alpha-L
Synonyms:CD11 antigen-like family member A CD_antigen=CD11a ITGAL LFA-1A Leukocyte adhesion glycoprotein LFA-1 alpha chain | Leukocyte function-associated molecule 1 alpha chain
Type:PROTEIN
Mol. Mass.:128748.90
Organism:Homo sapiens (Human)
Description:ChEMBL_629045
Residue:1170
Component 2
Name:Intercellular adhesion molecule 1
Synonyms:CD_antigen=CD54 ICAM1 Intercellular adhesion molecule (ICAM-1), Integrin alpha-L/beta-2 Intercellular adhesion molecule-1 | Major group rhinovirus receptor
Type:PROTEIN
Mol. Mass.:57831.10
Organism:Homo sapiens (Human)
Description:ChEMBL_826675
Residue:532
Component 3
Name:Integrin beta-2
Synonyms:CD18 ITGB2 MFI7
Type:PROTEIN
Mol. Mass.:84785.60
Organism:Homo sapiens (Human)
Description:EBI_12662
Residue:769
BDBM50199032
NameBDBM50199032
Synonyms:4-[(5S,9R)-9-(4-cyano-phenyl)-3-(3,5-dichloro-phenyl)-1-methyl-2,4-dioxo-1,3,7-triaza-spiro[4.4]non-7-yl]-4-oxo-butyric acid | CHEMBL215896
TypeSmall organic molecule
Emp. Form.C24H20Cl2N4O5
Mol. Mass.515.345
SMILESCN1C(=O)N(C(=O)[C@]11CN(C[C@H]1c1ccc(cc1)C#N)C(=O)CCC(O)=O)c1cc(Cl)cc(Cl)c1