Reaction Details
TargetTyrosine-protein kinase JAK1
LigandBDBM50426599
Substrate/Competitorn/a
Meas. Tech.ChEMBL_939262 (CHEMBL2329569)
IC50 0.590000±n/a nM
Citation Soth, MHermann, JCYee, CAlam, MBarnett, JWBerry, PBrowner, MFFrank, KFrauchiger, SHarris, SHe, YHekmat-Nejad, MHendricks, THenningsen, RHilgenkamp, RHo, HHoffman, AHsu, PYHu, DQItano, AJaime-Figueroa, SJahangir, AJin, SKuglstatter, AKutach, AKLiao, CLynch, SMenke, JNiu, LPatel, VRailkar, ARoy, DShao, AShaw, DSteiner, SSun, YTan, SLWang, SVu, MD 3-Amido pyrrolopyrazine JAK kinase inhibitors: development of a JAK3 vs JAK1 selective inhibitor and evaluation in cellular and in vivo models. J Med Chem56:345-56 (2013) 
 
Tyrosine-protein kinase JAK1
Name:Tyrosine-protein kinase JAK1
Type:Protein
Mol. Mass.:133293.73
Organism:Homo sapiens (Human)
Description:P23458
Residue:1154
BDBM50426599
NameBDBM50426599
Synonyms:CHEMBL2325898
TypeSmall organic molecule
Emp. Form.C20H22N6O2
Mol. Mass.378.4277
SMILESO=C(N[C@H](C1CC1)C(=O)N1CC[C@@H](C1)C#N)c1c[nH]c2ncc(nc12)C1CC1